Crosswalk Intel XDK experiences

Discussion and feedback on Construct 2

Post » Wed Nov 05, 2014 8:48 am

@IntelRobert
@cranberrygame

Will the gamepad api works with Google Nexus Player ? Anybody tried it ?
B
79
S
22
G
14
Posts: 389
Reputation: 12,324

Post » Wed Nov 05, 2014 1:23 pm

I'll know in a few weeks when my nexus player arrives :D

Crosswalk 8 does support gamepad API. Ashley did some testing and noted some issues, but we haven't had time to check them out.

tumira wrote:@IntelRobert
@cranberrygame

Will the gamepad api works with Google Nexus Player ? Anybody tried it ?
Intel Corporation
B
15
S
3
Posts: 193
Reputation: 1,552

Post » Wed Nov 05, 2014 3:28 pm

@IntelRobert is it possible to use different versions of Chrome in crosswalk such as using a version 40 canary build?
B
49
S
16
G
2
Posts: 110
Reputation: 4,359

Post » Thu Nov 06, 2014 12:24 pm

@twg

Each version of crosswalk contains a specific chrome version and it would be a big effort to integrate a different version. XDK is moving to crosswalk 9 in a week or so, which contains chrome 38. If you want to download and build yourself, you can use the crosswalk canary, which is at chrome 39: https://crosswalk-project.org/documenta ... loads.html
Intel Corporation
B
15
S
3
Posts: 193
Reputation: 1,552

Post » Fri Nov 07, 2014 5:15 am

since i updated Intel XDK, im having problem on building, if i add the Admob Plugin, when i remove it, it compile fine.
in the log file i can see this: 6 warnings

-----
[javac] warning: com/google/android/gms/ads/AdRequest.class(com/google/android/gms/ads:AdRequest.class): major version 51 is newer than 50, the highest major version supported by this compiler.
[javac] It is recommended that the compiler be upgraded.
[javac] warning: com/google/android/gms/ads/AdSize.class(com/google/android/gms/ads:AdSize.class): major version 51 is newer than 50, the highest major version supported by this compiler.
[javac] It is recommended that the compiler be upgraded.
[javac] warning: com/google/android/gms/ads/AdView.class(com/google/android/gms/ads:AdView.class): major version 51 is newer than 50, the highest major version supported by this compiler.
[javac] It is recommended that the compiler be upgraded.
[javac] warning: com/google/android/gms/ads/InterstitialAd.class(com/google/android/gms/ads:InterstitialAd.class): major version 51 is newer than 50, the highest major version supported by this compiler.
[javac] It is recommended that the compiler be upgraded.
[javac] warning: com/google/android/gms/ads/AdListener.class(com/google/android/gms/ads:AdListener.class): major version 51 is newer than 50, the highest major version supported by this compiler.
[javac] It is recommended that the compiler be upgraded.
[javac] warning: com/google/android/gms/ads/AdRequest$Builder.class(com/google/android/gms/ads:AdRequest$Builder.class): major version 51 is newer than 50, the highest major version supported by this compiler.
[javac] It is recommended that the compiler be upgraded.
[javac] Note: .../MathForKids/src/com/cranberrygame/phonegap/plugin/ad/Admob.java uses or overrides a deprecated API.
[javac] Note: Recompile with -Xlint:deprecation for details.
[javac] 6 warnings
---------
and this:
---BUILD FAILED
.../tools/ant/build.xml:892: The following error occurred while executing this line:
.../tools/ant/build.xml:894: The following error occurred while executing this line:
.../tools/ant/build.xml:906: The following error occurred while executing this line:
.../tools/ant/build.xml:283: null returned: 1
-----

anyone else facing the same error?

tx, bruno.
B
9
S
2
Posts: 52
Reputation: 1,360

Post » Fri Nov 07, 2014 6:53 am

@6bruno6 im having the same issue without the admob plugin

BUILD FAILED
.../tools/ant/build.xml:892: The following error occurred while executing this line:
.../tools/ant/build.xml:894: The following error occurred while executing this line:
.../tools/ant/build.xml:906: The following error occurred while executing this line:
.../tools/ant/build.xml:283: null returned: 1

those are the lines that matter
B
42
S
17
G
2
Posts: 850
Reputation: 6,209

Post » Fri Nov 07, 2014 10:59 am

Yep, I'm getting:

BUILD FAILED
.../tools/ant/build.xml:892: The following error occurred while executing this line:
.../tools/ant/build.xml:894: The following error occurred while executing this line:
.../tools/ant/build.xml:906: The following error occurred while executing this line:
.../tools/ant/build.xml:283: null returned: 1
B
11
S
3
Posts: 135
Reputation: 1,309

Post » Fri Nov 07, 2014 3:04 pm

same error here BUILD FAILED
B
24
S
3
G
1
Posts: 42
Reputation: 1,543

Post » Fri Nov 07, 2014 3:11 pm

Me too - if you take the plugin out, it builds fine. So it is most definitely a plugin issue. BTW - it was not working for me pre and post updating the XDK version. i think its an 'availability' issue of grabbing the plugin form the web (missing asset).
B
15
S
2
Posts: 229
Reputation: 1,353

Post » Fri Nov 07, 2014 3:31 pm

Maybe @cranberrygame, can help us on this one?

cheers!
B
9
S
2
Posts: 52
Reputation: 1,360

PreviousNext

Return to Construct 2 General

Who is online

Users browsing this forum: newt, whitephon and 9 guests